Target
RAC-alpha serine/threonine-protein kinase
Ligand
BDBM50316356
Substrate
Meas. Tech.
ChEMBL_627905 (CHEMBL1103721)
IC50
1324±n/a nM
Citation
 Nittoli, TDushin, RGIngalls, CCheung, KFloyd, MBFraser, HOlland, AHu, YGrosu, GHan, XArndt, KGuo, BWissner, A The identification of 8,9-dimethoxy-5-(2-aminoalkoxy-pyridin-3-yl)-benzo[c][2,7]naphthyridin-4-ylamines as potent inhibitors of 3-phosphoinositide-dependent kinase-1 (PDK-1). Eur J Med Chem 45:1379-86 (2010)  
Target
Name:
RAC-alpha serine/threonine-protein kinase
Synonyms:
AKT phosphorylation (p-AKT) AKT1/PPP1CA C-AKT PKB alpha Protein kinase B Protein kinase B (Akt 1) Protein kinase B alpha Proto-oncogene Akt (Akt1) Proto-oncogene c-Akt (AKT1) RAC-PK-alpha RAC-alpha serine/threonine-protein kinase (AKT1) | RAC-alpha serine/threonine-protein kinase (pAKT)
Type:
Enzyme
Mol. Mass.:
55681.25
Organism:
Homo sapiens (Human)
Description:
P31749
Residue:
480
  
Inhibitor
Name:
BDBM50316356
Synonyms:
2-(5-{[(2R)-2-Amino-3-(1H-indol-3-yl)propyl]oxy}pyridin-3-yl)-8,9-dimethoxybenzo[c]-2,7-naphthyridin-4-amine | CHEMBL1097604
Type:
Small organic molecule
Emp. Form.:
C30H28N6O3
Mol. Mass.:
520.5817
SMILES:
COc1cc2ncc3c(N)nc(cc3c2cc1OC)-c1cncc(OC[C@H](N)Cc2c[nH]c3ccccc23)c1
: