Target
Integrin alpha-L
Ligand
BDBM50318230
Substrate
Meas. Tech.
ChEMBL_629042 (CHEMBL1120946)
IC50
8±n/a nM
Citation
 Watterson, SHXiao, ZDodd, DSTortolani, DRVaccaro, WPotin, DLaunay, MStetsko, DKSkala, SDavis, PMLee, DYang, XMcIntyre, KWBalimane, PPatel, KYang, ZMarathe, PKadiyala, PTebben, AJSheriff, SChang, CYZiemba, TZhang, HChen, BCDelMonte, AJAranibar, NMcKinnon, MBarrish, JCSuchard, SJMurali Dhar, TG Small molecule antagonist of leukocyte function associated antigen-1 (LFA-1): structure-activity relationships leading to the identification of 6-((5S,9R)-9-(4-cyanophenyl)-3-(3,5-dichlorophenyl)-1-methyl-2,4-dioxo-1,3,7-triazaspiro[4.4]nonan-7-yl)nicotinic acid (BMS-688521). J Med Chem 53:3814-30 (2010)  
Target
Name:
Integrin alpha-L
Synonyms:
CD11 antigen-like family member A CD_antigen=CD11a ITGAL LFA-1A Leukocyte adhesion glycoprotein LFA-1 alpha chain | Leukocyte function-associated molecule 1 alpha chain
Type:
PROTEIN
Mol. Mass.:
128748.90
Organism:
Homo sapiens (Human)
Description:
ChEMBL_629045
Residue:
1170
  
Inhibitor
Name:
BDBM50318230
Synonyms:
6-((5S,9R)-9-(4-Cyanophenyl)-3-(3,5-dichlorophenyl)-1-methyl-2,4-dioxo-1,3,7-triazaspiro[4.4]nonan-7-yl)pyrimidine-4-carboxylic Acid | CHEMBL1098760
Type:
Small organic molecule
Emp. Form.:
C25H18Cl2N6O4
Mol. Mass.:
537.354
SMILES:
CN1C(=O)N(C(=O)[C@]11CN(C[C@H]1c1ccc(cc1)C#N)c1cc(ncn1)C(O)=O)c1cc(Cl)cc(Cl)c1
: