Target
Alpha-galactosidase
Ligand
BDBM50241865
Substrate
Meas. Tech.
ChEMBL_639187 (CHEMBL1168040)
pH
6.5±n/a
IC50
780±n/a nM
Comments
extracted
Citation
 Kato, AYamashita, YNakagawa, SKoike, YAdachi, IHollinshead, JNash, RJIkeda, KAsano, N 2,5-Dideoxy-2,5-imino-d-altritol as a new class of pharmacological chaperone for Fabry disease. Bioorg Med Chem 18:3790-4 (2010)  
Target
Name:
Alpha-galactosidase
Synonyms:
α-galactosidase Alpha-galactosidase
Type:
Protein
Mol. Mass.:
41306.82
Organism:
Coffea arabica (Coffee beans)
Description:
Residue:
378
  
Inhibitor
Name:
BDBM50241865
Synonyms:
2,5-dideoxy-2,5-imino-D-altritol CHEMBL469844
Type:
Small organic molecule
Emp. Form.:
C6H13NO4
Mol. Mass.:
163.1717
SMILES:
OC[C@H]1N[C@H](CO)[C@H](O)[C@@H]1O
: