Target
Transporter
Ligand
BDBM50302225
Substrate
Meas. Tech.
ChEMBL_649988 (CHEMBL1219686)
Ki
10500±n/a nM
Citation
 Zhang, PCyriac, GKopajtic, TZhao, YJavitch, JAKatz, JLNewman, AH Structure-activity relationships for a novel series of citalopram (1-(3-(dimethylamino)propyl)-1-(4-fluorophenyl)-1,3-dihydroisobenzofuran-5-carbonitrile) analogues at monoamine transporters. J Med Chem 53:6112-21 (2010)  
Target
Name:
Transporter
Synonyms:
NE transporter Norepinephrine transporter(NET)
Type:
Multi-pass membrane protein
Mol. Mass.:
69236.90
Organism:
Rattus norvegicus (rat)
Description:
Q63380
Residue:
617
  
Inhibitor
Name:
BDBM50302225
Synonyms:
(1S)-1-[3-(dimethylamino)propyl]-1-(4-fluorophenyl)-1,3-dihydro-2-benzofuran-5-carbonitrile CHEMBL1508 ESCITALOPRAM OXALATE escitalopram
Type:
Small organic molecule
Emp. Form.:
C20H21FN2O
Mol. Mass.:
324.3919
SMILES:
CN(C)CCC[C@]1(OCc2cc(ccc12)C#N)c1ccc(F)cc1
: