Target
Serine/threonine-protein kinase Chk1
Ligand
BDBM50325158
Substrate
Meas. Tech.
ChEMBL_651698 (CHEMBL1228388)
IC50
20±n/a nM
Citation
 Oza, VAshwell, SBrassil, PBreed, JDeng, CEzhuthachan, JHaye, HHorn, CJanetka, JLyne, PNewcombe, NOtterbien, LPass, MRead, JRoswell, SSu, MToader, DYu, DYu, YValentine, AWebborn, PWhite, AZabludoff, SZheng, X Discovery of a novel class of triazolones as checkpoint kinase inhibitors--hit to lead exploration. Bioorg Med Chem Lett 20:5133-8 (2010)  
Target
Name:
Serine/threonine-protein kinase Chk1
Synonyms:
CHEK1 CHK1 checkpoint homolog Checkpoint kinase-1 (CHK1)
Type:
Enzyme Catalytic Domain
Mol. Mass.:
54443.02
Organism:
Homo sapiens (Human)
Description:
gi_166295192
Residue:
476
  
Inhibitor
Name:
BDBM50325158
Synonyms:
CHEMBL1223317 | N-ethyl-4-(5-methyl-1-oxo-1,2-dihydro-[1,2,4]triazolo[4,3-a]quinolin-8-yl)benzamide
Type:
Small organic molecule
Emp. Form.:
C20H18N4O2
Mol. Mass.:
346.3825
SMILES:
CCNC(=O)c1ccc(cc1)-c1ccc2c(C)cc3n[nH]c(=O)n3c2c1
: