Target
Cholinesterase
Ligand
BDBM10624
Substrate
Meas. Tech.
ChEMBL_718129 (CHEMBL1671582)
IC50
354000±n/a nM
Citation
 Musilek, KKomloova, MHolas, OHrabinova, MPohanka, MDohnal, VNachon, FDolezal, MKuca, K Preparation and in vitro screening of symmetrical bis-isoquinolinium cholinesterase inhibitors bearing various connecting linkage--implications for early Myasthenia gravis treatment. Eur J Med Chem 46:811-8 (2011)  
Target
Name:
Cholinesterase
Synonyms:
Acylcholine acylhydrolase Butyrylcholine esterase (BChE) Butyrylcholinesterase (BuChE) CHLE_HUMAN Cholinesterases Pseudocholinesterase
Type:
Homotetramer
Mol. Mass.:
68422.27
Organism:
Homo sapiens (Human)
Description:
P06276
Residue:
602
  
Inhibitor
Name:
BDBM10624
Synonyms:
1,5-bis(4-allyldimethylammoniumphenyl)-pentan-3-one dibromide BW284c51 CHEMBL464538
Type:
Small organic molecule
Emp. Form.:
C27H38N2O
Mol. Mass.:
406.6023
SMILES:
C[N+](C)(CC=C)c1ccc(CCC(=O)CCc2ccc(cc2)[N+](C)(C)CC=C)cc1
: