Target
Hydroxycarboxylic acid receptor 2
Ligand
BDBM50337019
Substrate
Meas. Tech.
ChEMBL_718725 (CHEMBL1680944)
EC50
3119±n/a nM
Citation
 Qin, JRao, AChen, XZhu, XLiu, ZHuang, XDegrado, SHuang, YXiao, DAslanian, RCheewatrakoolpong, BZhang, HGreenfeder, SFarley, CCook, JKurowski, SLi, QHeek, MvChintala, MWang, GHsieh, YLi, F Discovery of a Potent Nicotinic Acid Receptor Agonist for the Treatment of Dyslipidemia ACS Med Chem Lett 2:171-176 (2011)  
Target
Name:
Hydroxycarboxylic acid receptor 2
Synonyms:
G-protein coupled receptor 109A GPR109A HCAR2 HM74A NIACR1 Nicotinic acid receptor 1
Type:
G Protein-Coupled Receptor (GPCR)
Mol. Mass.:
41868.22
Organism:
Homo sapiens (Human)
Description:
Membranes from CHO cells expressing the recombinant human GPR109A were used in competition binding assay.
Residue:
363
  
Inhibitor
Name:
BDBM50337019
Synonyms:
2-(difluoromethyl)-5-(3-(1-phenylcyclopropyl)propyl)-3H-pyrano[2,3-d]pyrimidine-4,7-dione | CHEMBL1672643
Type:
Small organic molecule
Emp. Form.:
C20H18F2N2O3
Mol. Mass.:
372.3653
SMILES:
FC(F)c1nc2oc(=O)cc(CCCC3(CC3)c3ccccc3)c2c(=O)[nH]1
: