Target
Fibroblast growth factor receptor 1
Ligand
BDBM11242
Substrate
Meas. Tech.
ChEMBL_729714 (CHEMBL1697115)
IC50
13100±n/a nM
Citation
 Ren, XDuan, LHe, QZhang, ZZhou, YWu, DPan, JPei, DDing, KDing, K. Identification of Niclosamide as a New Small-Molecule Inhibitor of the STAT3 Signaling Pathway. ACS Med Chem Lett 1:454-459 (2010)  
Target
Name:
Fibroblast growth factor receptor 1
Synonyms:
BFGFR Basic fibroblast growth factor receptor 1 (FGFR1) CEK FGFR-1 FGFR-1, (FL) FGFR1_HUMAN FLT2 Fibroblast growth factor receptor 1 (FGFR-1) Fms-like tyrosine kinase 2 N-sam bFGF-R | c-fgr
Type:
Receptor
Mol. Mass.:
91861.70
Organism:
Homo sapiens (Human)
Description:
P11362
Residue:
822
  
Inhibitor
Name:
BDBM11242
Synonyms:
5-chloro-N-(2-chloro-4-nitrophenyl)-2-hydroxybenzamide niclosamide
Type:
Small organic molecule
Emp. Form.:
C13H8Cl2N2O4
Mol. Mass.:
327.12
SMILES:
Oc1ccc(Cl)cc1C(=O)Nc1ccc(cc1Cl)[N+]([O-])=O
: