Target
Solute carrier family 22 member 12
Ligand
BDBM50206509
Substrate
Meas. Tech.
ChEMBL_743865 (CHEMBL1767808)
IC50
86390±n/a nM
Citation
 Wempe, MFJutabha, PQuade, BIwen, TJFrick, MMRoss, IRRice, PJAnzai, NEndou, H Developing potent human uric acid transporter 1 (hURAT1) inhibitors. J Med Chem 54:2701-13 (2011)  
Target
Name:
Solute carrier family 22 member 12
Synonyms:
OATL4 RST S22AC_HUMAN Solute carrier family 22 member 12 URAT1 Urate anion exchanger 1 (URAT1) | Uric Acid Transporter 1 (URAT1)
Type:
Enzyme
Mol. Mass.:
59638.65
Organism:
Homo sapiens (Human)
Description:
Q96S37
Residue:
553
  
Inhibitor
Name:
BDBM50206509
Synonyms:
4-Dipropylsulfamoyl-benzoic acid 4-Dipropylsulfamoyl-benzoic acid(probenecid) CHEMBL897 Probalan
Type:
Small organic molecule
Emp. Form.:
C13H19NO4S
Mol. Mass.:
285.359
SMILES:
CCCN(CCC)S(=O)(=O)c1ccc(cc1)C(O)=O
: