Target
cAMP and cAMP-inhibited cGMP 3',5'-cyclic phosphodiesterase 10A
Ligand
BDBM50350804
Substrate
Meas. Tech.
ChEMBL_763299 (CHEMBL1820393)
IC50
247±n/a nM
Citation
 Helal, CJKang, ZHou, XPandit, JChappie, TAHumphrey, JMMarr, ESFennell, KFChenard, LKFox, CSchmidt, CJWilliams, RDChapin, DSSiuciak, JLebel, LMenniti, FCianfrogna, JFonseca, KRNelson, FRO'Connor, RMacDougall, MMcDowell, LLiras, S Use of structure-based design to discover a potent, selective, in vivo active phosphodiesterase 10A inhibitor lead series for the treatment of schizophrenia. J Med Chem 54:4536-47 (2011)  
Target
Name:
cAMP and cAMP-inhibited cGMP 3',5'-cyclic phosphodiesterase 10A
Synonyms:
PDE10_RAT Phosphodiesterase 10 Phosphodiesterase Type 10 (PDE10A) | Rat recombinant PDE10a (rPDE10a)
Type:
Enzyme
Mol. Mass.:
90160.88
Organism:
Rattus norvegicus (rat)
Description:
PDE10A was generated from the full-length recombinant rat clone transfected into Sf9 cells.
Residue:
794
  
Inhibitor
Name:
BDBM50350804
Synonyms:
CHEMBL1819128
Type:
Small organic molecule
Emp. Form.:
C27H28N4O2
Mol. Mass.:
440.5368
SMILES:
COc1cc2ncnc(N3CCCC(C3)c3ccccc3)c2cc1OCCc1ccccn1
: