Target
DNA (cytosine-5)-methyltransferase 1
Ligand
BDBM50357281
Substrate
Meas. Tech.
ChEMBL_788458 (CHEMBL1918223)
IC50
270000±n/a nM
Citation
 Castellano, SKuck, DViviano, MYoo, JLópez-Vallejo, FConti, PTamborini, LPinto, AMedina-Franco, JLSbardella, G Synthesis and biochemical evaluation ofd(2)-isoxazoline derivatives as DNA methyltransferase 1 inhibitors. J Med Chem 54:7663-77 (2011)  
Target
Name:
DNA (cytosine-5)-methyltransferase 1
Synonyms:
AIM CXXC9 DNA (cytosine-5)-methyltransferase 1 isoform b DNA methyltransferase HsaI DNMT1 M.HsaI | MCMT
Type:
Enzyme
Mol. Mass.:
183184.85
Organism:
Homo sapiens (Human)
Description:
P26358
Residue:
1616
  
Inhibitor
Name:
BDBM50357281
Synonyms:
CHEMBL1916669
Type:
Small organic molecule
Emp. Form.:
C12H17N3O
Mol. Mass.:
219.2829
SMILES:
CN(C)CC1CC(=NO1)c1ccc(N)cc1
: