Target
Interstitial collagenase
Ligand
BDBM50365344
Substrate
Meas. Tech.
ChEMBL_806638 (CHEMBL1960121)
Ki
>10000±n/a nM
Target
Name:
Interstitial collagenase
Synonyms:
CLG MMP1 Matrix metalloproteinase-1 | Matrix metalloproteinase-1 (MMP-1)
Type:
Enzyme
Mol. Mass.:
54010.26
Organism:
Homo sapiens (Human)
Description:
P03956
Residue:
469
  
Inhibitor
Name:
BDBM50365344
Synonyms:
CHEMBL1956115
Type:
Small organic molecule
Emp. Form.:
C18H21NO4S
Mol. Mass.:
347.429
SMILES:
C[C@@](CCc1ccc(cc1)-c1ccccc1)(C(=O)NO)S(C)(=O)=O
: