Target
Sodium-dependent serotonin transporter
Ligand
BDBM22418
Substrate
Meas. Tech.
ChEMBL_202130 (CHEMBL808119)
Ki
160±n/a nM
Citation
 Prakash, KRTamiz, APAraldi, GLZhang, MJohnson, KMKozikowski, AP N-phenylalkyl-substituted tropane analogs of boat conformation with high selectivity for the dopamine versus serotonin transporter. Bioorg Med Chem Lett 9:3325-8 (2000)  
Target
Name:
Sodium-dependent serotonin transporter
Synonyms:
5-HT Transporter 5HT transporter Anandamid membrane transporter, AMT Monoamine transporters; Norepinephrine & serotonin Slc6a4 Sodium-dependent serotonin transporter (SERT) | imipramine receptor
Type:
Multi-pass membrane protein
Mol. Mass.:
70168.43
Organism:
Rattus norvegicus (rat)
Description:
P31652
Residue:
630
  
Inhibitor
Name:
BDBM22418
Synonyms:
Cocaine methyl (1R,2R,3S,5S)-3-(benzoyloxy)-8-methyl-8-azabicyclo[3.2.1]octane-2-carboxylate | methyl (1R,2R,3S,5S)-8-methyl-3-[(phenylcarbonyl)oxy]-8-azabicyclo[3.2.1]octane-2-carboxylate
Type:
Emp. Form.:
C17H21NO4
Mol. Mass.:
303.3529
SMILES:
[H][C@]12CC[C@]([H])([C@H]([C@H](C1)OC(=O)c1ccccc1)C(=O)OC)N2C
: