Target
Adenosine transporter 1
Ligand
BDBM50089704
Substrate
Meas. Tech.
ChEBML_31141
Ki
>1000000±n/a nM
Citation
 Soulère, LHoffmann, PBringaud, FPérié, J Synthesis and uptake of nitric oxide-releasing drugs by the P2 nucleoside transporter in Trypanosoma equiperdum. Bioorg Med Chem Lett 10:1347-50 (2000)  
Target
Name:
Adenosine transporter 1
Synonyms:
Type:
PROTEIN
Mol. Mass.:
51044.02
Organism:
Trypanosoma brucei
Description:
ChEMBL_31141
Residue:
463
  
Inhibitor
Name:
BDBM50089704
Synonyms:
CHEMBL25961 | nitrooxymethyl-benzene
Type:
Small organic molecule
Emp. Form.:
C7H7NO3
Mol. Mass.:
153.1354
SMILES:
[O-][N+](=O)OCc1ccccc1
: