Target
GTP:AMP phosphotransferase AK3, mitochondrial
Ligand
BDBM50010310
Substrate
Meas. Tech.
ChEMBL_32200 (CHEMBL648979)
Ki
70000±n/a nM
Citation
 Hampton, AKappler, FPicker, D Species- or isozyme-specific enzyme inhibitors. 4. Design of a two-site inhibitor of adenylate kinase with isozyme selectivity. J Med Chem 25:638-44 (1982)  
Target
Name:
GTP:AMP phosphotransferase AK3, mitochondrial
Synonyms:
AK 3 Adenylate kinase 3 alpha like 1 Ak3 Akl3l KAD3_RAT
Type:
PROTEIN
Mol. Mass.:
25443.58
Organism:
Rattus norvegicus
Description:
ChEMBL_1340551
Residue:
227
  
Inhibitor
Name:
BDBM50010310
Synonyms:
CHEMBL3251359
Type:
Small organic molecule
Emp. Form.:
C13H22N5O13P3S
Mol. Mass.:
581.326
SMILES:
CCCSc1nc2c(N)ncnc2n1[C@@H]1O[C@H](COP(O)(=O)OP(O)(=O)OP(O)(O)=O)[C@@H](O)[C@H]1O
: