Target
Adenosine receptor A2a
Ligand
BDBM50020849
Substrate
Meas. Tech.
ChEBML_27639
Ki
900±n/a nM
Citation
 Daly, JWPadgett, WShamim, MTButts-Lamb, PWaters, J 1,3-Dialkyl-8-(p-sulfophenyl)xanthines: potent water-soluble antagonists for A1- and A2-adenosine receptors. J Med Chem 28:487-92 (1985)  
Target
Name:
Adenosine receptor A2a
Synonyms:
AA2AR_CAVPO ADORA2A | Adenosine A2a receptor
Type:
Enzyme Catalytic Domain
Mol. Mass.:
44955.08
Organism:
GUINEA PIG
Description:
ADENOSINE A2 0 GUINEA PIG::P46616
Residue:
409
  
Inhibitor
Name:
BDBM50020849
Synonyms:
8-(3-Amino-phenyl)-1,3-dimethyl-3,7-dihydro-purine-2,6-dione | CHEMBL11033
Type:
Small organic molecule
Emp. Form.:
C13H13N5O2
Mol. Mass.:
271.2746
SMILES:
Cn1c2nc([nH]c2c(=O)n(C)c1=O)-c1cccc(N)c1
: