Target
3-hydroxy-3-methylglutaryl-coenzyme A reductase
Ligand
BDBM50421879
Substrate
Meas. Tech.
ChEBML_80668
IC50
5700±n/a nM
Citation
 Sit, SYParker, RAMotoc, IHan, WBalasubramanian, NCatt, JDBrown, PJHarte, WEThompson, MDWright, JJ Synthesis, biological profile, and quantitative structure-activity relationship of a series of novel 3-hydroxy-3-methylglutaryl coenzyme A reductase inhibitors. J Med Chem 33:2982-99 (1990)  
Target
Name:
3-hydroxy-3-methylglutaryl-coenzyme A reductase
Synonyms:
HMDH_RAT Hmgcr
Type:
Enzyme
Mol. Mass.:
96689.85
Organism:
Rattus norvegicus (rat)
Description:
Isolated rat liver microsomes were used as enzyme source.
Residue:
887
  
Inhibitor
Name:
BDBM50421879
Synonyms:
CHEMBL2304072
Type:
Small organic molecule
Emp. Form.:
C24H21F2N4O4
Mol. Mass.:
467.4453
SMILES:
Cn1nnnc1C(C=C=C[C@@H](O)C[C@@H](O)CC([O-])=O)=C(c1ccc(F)cc1)c1ccc(F)cc1
: