Target
3-hydroxy-3-methylglutaryl-coenzyme A reductase
Ligand
BDBM50014355
Substrate
Meas. Tech.
ChEMBL_80669 (CHEMBL691798)
IC50
52±n/a nM
Citation
 Sit, SYParker, RAMotoc, IHan, WBalasubramanian, NCatt, JDBrown, PJHarte, WEThompson, MDWright, JJ Synthesis, biological profile, and quantitative structure-activity relationship of a series of novel 3-hydroxy-3-methylglutaryl coenzyme A reductase inhibitors. J Med Chem 33:2982-99 (1990)  
Target
Name:
3-hydroxy-3-methylglutaryl-coenzyme A reductase
Synonyms:
HMDH_RAT Hmgcr
Type:
Enzyme
Mol. Mass.:
96689.85
Organism:
Rattus norvegicus (rat)
Description:
Isolated rat liver microsomes were used as enzyme source.
Residue:
887
  
Inhibitor
Name:
BDBM50014355
Synonyms:
CHEMBL103585 | Sodium; 7-(4'-fluoro-3,5,3'-trimethyl-biphenyl-2-yl)-3,5-dihydroxy-hept-6-enoate (XU-62320)
Type:
Small organic molecule
Emp. Form.:
C22H24FO4
Mol. Mass.:
371.4225
SMILES:
Cc1cc(C)c(\C=C\[C@@H](O)C[C@@H](O)CC([O-])=O)c(c1)-c1ccc(F)c(C)c1
: