Target
Alcohol dehydrogenase 1A
Ligand
BDBM50368954
Substrate
Meas. Tech.
ChEMBL_30835 (CHEMBL645234)
Ki
2.0±n/a nM
Citation
 Goldstein, BMLi, HJones, JPBell, JEZeidler, JPankiewicz, KWWatanabe, KA CNAD: a potent and specific inhibitor of alcohol dehydrogenase. J Med Chem 37:392-9 (1994)  
Target
Name:
Alcohol dehydrogenase 1A
Synonyms:
ADH1 ADH1A_HUMAN Alcohol dehydrogenase 1A Alcohol dehydrogenase subunit alpha
Type:
PROTEIN
Mol. Mass.:
39866.36
Organism:
Homo sapiens (Human)
Description:
ChEMBL_31168
Residue:
375
  
Inhibitor
Name:
BDBM50368954
Synonyms:
CHEMBL610377
Type:
Small organic molecule
Emp. Form.:
C21H27N7O14P2
Mol. Mass.:
663.4251
SMILES:
NC(=O)c1cncc(c1)[C@@H]1O[C@H](COP(O)(=O)OP(O)(=O)OC[C@H]2OC([C@H](O)[C@@H]2O)n2cnc3c(N)ncnc23)[C@@H](O)[C@H]1O
: