Target
cGMP-specific 3',5'-cyclic phosphodiesterase
Ligand
BDBM50100681
Substrate
Meas. Tech.
ChEMBL_154560 (CHEMBL757895)
IC50
>10000±n/a nM
Citation
 Ukita, TNakamura, YKubo, AYamamoto, YMoritani, YSaruta, KHigashijima, TKotera, JTakagi, MKikkawa, KOmori, K Novel, potent, and selective phosphodiesterase 5 inhibitors: synthesis and biological activities of a series of 4-aryl-1-isoquinolinone derivatives. J Med Chem 44:2204-18 (2001)  
Target
Name:
cGMP-specific 3',5'-cyclic phosphodiesterase
Synonyms:
CGB-PDE PDE5A Phosphodiesterase 5A cGMP-specific 3',5'-cyclic phosphodiesterase
Type:
PROTEIN
Mol. Mass.:
98285.03
Organism:
Canis lupus familiaris
Description:
ChEMBL_105565
Residue:
865
  
Inhibitor
Name:
BDBM50100681
Synonyms:
2-(4-Dimethylamino-phenyl)-6,7-dimethoxy-1-oxo-4-(3,4,5-trimethoxy-phenyl)-1,2-dihydro-isoquinoline-3-carboxylic acid methyl ester; hydrochloride | CHEMBL539779
Type:
Small organic molecule
Emp. Form.:
C30H32N2O8
Mol. Mass.:
548.5837
SMILES:
COC(=O)c1c(-c2cc(OC)c(OC)c(OC)c2)c2cc(OC)c(OC)cc2c(=O)n1-c1ccc(cc1)N(C)C
: