Target
Sodium-dependent serotonin transporter
Ligand
BDBM50005536
Substrate
Meas. Tech.
ChEMBL_201363 (CHEMBL805346)
Ki
50±n/a nM
Citation
 Houlihan, WJKelly, LPankuch, JKoletar, JBrand, LJanowsky, AKopajtic, TA Mazindol analogues as potential inhibitors of the cocaine binding site at the dopamine transporter. J Med Chem 45:4097-109 (2002)  
Target
Name:
Sodium-dependent serotonin transporter
Synonyms:
5-HT Transporter 5HTT SC6A4_HUMAN SLC6A4 Serotonin transporter (5HTT) Sodium-dependent serotonin transporter (SERT) | Solute carrier family 6 member 4
Type:
Multi-pass membrane protein
Mol. Mass.:
70322.51
Organism:
Homo sapiens (Human)
Description:
P31645
Residue:
630
  
Inhibitor
Name:
BDBM50005536
Synonyms:
42-548 5-(4-chlorophenyl)-3,5-dihydro-2H-imidazo[2,1-a]isoindol-5-ol CHEMBL781 Mazanor mazindole
Type:
Small organic molecule
Emp. Form.:
C16H13ClN2O
Mol. Mass.:
284.74
SMILES:
OC1(N2CCN=C2c2ccccc12)c1ccc(Cl)cc1
: