Target
Amiloride-sensitive amine oxidase [copper-containing]
Ligand
BDBM50161141
Substrate
Meas. Tech.
ChEMBL_306517 (CHEMBL828122)
IC50
>100000±n/a nM
Citation
 Bertini, VBuffoni, FIgnesti, GPicci, NTrombino, SIemma, FAlfei, SPocci, MLucchesini, FDe Munno, A Alkylamino derivatives of 4-aminomethylpyridine as inhibitors of copper-containing amine oxidases. J Med Chem 48:664-70 (2005)  
Target
Name:
Amiloride-sensitive amine oxidase [copper-containing]
Synonyms:
ABP AOC1 Amiloride-binding protein DAO1 Diamine oxidase (DAO) KAO | Kidney amine oxidase
Type:
Protein
Mol. Mass.:
85387.64
Organism:
Homo sapiens (Human)
Description:
P19801
Residue:
751
  
Inhibitor
Name:
BDBM50161141
Synonyms:
4-(aminomethyl)-N,N-dicyclopentylpyridin-3-amine dihydrochloride | CHEMBL559376
Type:
Small organic molecule
Emp. Form.:
C16H25N3
Mol. Mass.:
259.3898
SMILES:
NCc1ccncc1N(C1CCCC1)C1CCCC1
: