Target
Amiloride-sensitive amine oxidase [copper-containing]
Ligand
BDBM50161134
Substrate
Meas. Tech.
ChEMBL_306517 (CHEMBL828122)
IC50
2500±n/a nM
Citation
 Bertini, VBuffoni, FIgnesti, GPicci, NTrombino, SIemma, FAlfei, SPocci, MLucchesini, FDe Munno, A Alkylamino derivatives of 4-aminomethylpyridine as inhibitors of copper-containing amine oxidases. J Med Chem 48:664-70 (2005)  
Target
Name:
Amiloride-sensitive amine oxidase [copper-containing]
Synonyms:
ABP AOC1 Amiloride-binding protein DAO1 Diamine oxidase (DAO) KAO | Kidney amine oxidase
Type:
Protein
Mol. Mass.:
85387.64
Organism:
Homo sapiens (Human)
Description:
P19801
Residue:
751
  
Inhibitor
Name:
BDBM50161134
Synonyms:
4-(aminomethyl)-N-ethyl-5-[ethyl(methyl)-lambda~5~-azanyl]pyridin-3-amine dihydrochloride | CHEMBL537623
Type:
Small organic molecule
Emp. Form.:
C11H20N4
Mol. Mass.:
208.3033
SMILES:
CCNc1cncc(N(C)CC)c1CN
: