Target
Amiloride-sensitive amine oxidase [copper-containing]
Ligand
BDBM50161135
Substrate
Meas. Tech.
ChEMBL_306517 (CHEMBL828122)
IC50
160±n/a nM
Citation
 Bertini, VBuffoni, FIgnesti, GPicci, NTrombino, SIemma, FAlfei, SPocci, MLucchesini, FDe Munno, A Alkylamino derivatives of 4-aminomethylpyridine as inhibitors of copper-containing amine oxidases. J Med Chem 48:664-70 (2005)  
Target
Name:
Amiloride-sensitive amine oxidase [copper-containing]
Synonyms:
ABP AOC1 Amiloride-binding protein DAO1 Diamine oxidase (DAO) KAO | Kidney amine oxidase
Type:
Protein
Mol. Mass.:
85387.64
Organism:
Homo sapiens (Human)
Description:
P19801
Residue:
751
  
Inhibitor
Name:
BDBM50161135
Synonyms:
4-(aminomethyl)-N-methylpyridin-3-amine dihydrochloride | CHEMBL534914
Type:
Small organic molecule
Emp. Form.:
C7H11N3
Mol. Mass.:
137.1823
SMILES:
CNc1cnccc1CN
: