Target
Amiloride-sensitive amine oxidase [copper-containing]
Ligand
BDBM50161131
Substrate
Meas. Tech.
ChEMBL_306517 (CHEMBL828122)
IC50
>1000000±n/a nM
Citation
 Bertini, VBuffoni, FIgnesti, GPicci, NTrombino, SIemma, FAlfei, SPocci, MLucchesini, FDe Munno, A Alkylamino derivatives of 4-aminomethylpyridine as inhibitors of copper-containing amine oxidases. J Med Chem 48:664-70 (2005)  
Target
Name:
Amiloride-sensitive amine oxidase [copper-containing]
Synonyms:
ABP AOC1 Amiloride-binding protein DAO1 Diamine oxidase (DAO) KAO | Kidney amine oxidase
Type:
Protein
Mol. Mass.:
85387.64
Organism:
Homo sapiens (Human)
Description:
P19801
Residue:
751
  
Inhibitor
Name:
BDBM50161131
Synonyms:
CHEMBL536951 | [3-(benzyloxy)-5-ethoxypyridin-4-yl]methylamine dihydrochloride
Type:
Small organic molecule
Emp. Form.:
C15H18N2O2
Mol. Mass.:
258.3156
SMILES:
CCOc1cncc(OCc2ccccc2)c1CN
: