Target
Integrase
Ligand
BDBM50184625
Substrate
Meas. Tech.
ChEMBL_355503 (CHEMBL871193)
IC50
5000±n/a nM
Citation
 Walker, MAJohnson, TMa, ZBanville, JRemillard, RKim, OZhang, YStaab, AWong, HTorri, ASamanta, HLin, ZDeminie, CTerry, BKrystal, MMeanwell, N Triketoacid inhibitors of HIV-integrase: a new chemotype useful for probing the integrase pharmacophore. Bioorg Med Chem Lett 16:2920-4 (2006)  
Target
Name:
Integrase
Synonyms:
Human immunodeficiency virus type 1 integrase
Type:
PROTEIN
Mol. Mass.:
32231.48
Organism:
Human immunodeficiency virus 1
Description:
ChEMBL_90865
Residue:
288
  
Inhibitor
Name:
BDBM50184625
Synonyms:
6-(2-bromophenyl)-2-hydroxy-4-oxohex-2-enoic acid | CHEMBL210977
Type:
Small organic molecule
Emp. Form.:
C12H11BrO4
Mol. Mass.:
299.117
SMILES:
OC(=O)C(=O)CC(=O)CCc1ccccc1Br
: