Target
Integrase
Ligand
BDBM50184626
Substrate
Meas. Tech.
ChEMBL_355504 (CHEMBL871194)
IC50
600±n/a nM
Citation
 Walker, MAJohnson, TMa, ZBanville, JRemillard, RKim, OZhang, YStaab, AWong, HTorri, ASamanta, HLin, ZDeminie, CTerry, BKrystal, MMeanwell, N Triketoacid inhibitors of HIV-integrase: a new chemotype useful for probing the integrase pharmacophore. Bioorg Med Chem Lett 16:2920-4 (2006)  
Target
Name:
Integrase
Synonyms:
Human immunodeficiency virus type 1 integrase
Type:
PROTEIN
Mol. Mass.:
32231.48
Organism:
Human immunodeficiency virus 1
Description:
ChEMBL_90865
Residue:
288
  
Inhibitor
Name:
BDBM50184626
Synonyms:
6-(2-chlorophenyl)-2,4,6-trioxohexanoic acid | CHEMBL211014
Type:
Small organic molecule
Emp. Form.:
C12H9ClO5
Mol. Mass.:
268.65
SMILES:
OC(=O)C(=O)CC(=O)CC(=O)c1ccccc1Cl
: