Target
Sodium-dependent dopamine transporter
Ligand
BDBM50202395
Substrate
Meas. Tech.
ChEMBL_423467 (CHEMBL911118)
Ki
11±n/a nM
Citation
 Froimowitz, MGu, YDakin, LANagafuji, PMKelley, CJParrish, DDeschamps, JRJanowsky, A Slow-onset, long-duration, alkyl analogues of methylphenidate with enhanced selectivity for the dopamine transporter. J Med Chem 50:219-32 (2007)  
Target
Name:
Sodium-dependent dopamine transporter
Synonyms:
DA transporter DAT1 Dopamine transporter protein (DAT) SC6A3_HUMAN Sodium-dependent dopamine transporter Solute carrier family 6 member 3
Type:
Multi-pass membrane protein
Mol. Mass.:
68497.11
Organism:
Homo sapiens (Human)
Description:
Q01959
Residue:
620
  
Inhibitor
Name:
BDBM50202395
Synonyms:
(RS/SR)-2-[1-(4-chlorophenyl)butyl]piperidine | CHEMBL218847
Type:
Small organic molecule
Emp. Form.:
C15H22ClN
Mol. Mass.:
251.795
SMILES:
CCCC(C1CCCCN1)c1ccc(Cl)cc1
: