Target
Lysophosphatidic acid receptor 2
Ligand
BDBM50373815
Substrate
Meas. Tech.
ChEMBL_468543 (CHEMBL930968)
IC50
170±n/a nM
Citation
 Beck, HPKohn, TRubenstein, SHedberg, CSchwandner, RHasslinger, KDai, KLi, CLiang, LWesche, HFrank, BAn, SWickramasinghe, DJaen, JMedina, JHungate, RShen, W Discovery of potent LPA2 (EDG4) antagonists as potential anticancer agents. Bioorg Med Chem Lett 18:1037-41 (2008)  
Target
Name:
Lysophosphatidic acid receptor 2
Synonyms:
EDG4 LPA-2 LPAR2 Lysophosphatidic acid receptor 2 | Lysophosphatidic acid receptor Edg-4
Type:
PROTEIN
Mol. Mass.:
39103.44
Organism:
Homo sapiens (Human)
Description:
ChEMBL_1451385
Residue:
351
  
Inhibitor
Name:
BDBM50373815
Synonyms:
CHEMBL401756
Type:
Small organic molecule
Emp. Form.:
C21H27N5O2S2
Mol. Mass.:
445.601
SMILES:
C[C@@H](CN1CCN(CC1)S(=O)(=O)c1ccc(C)cc1)Nc1ncnc2c(C)csc12
: