Target
Alpha-1A adrenergic receptor
Ligand
BDBM50377387
Substrate
Meas. Tech.
ChEMBL_479649 (CHEMBL921450)
EC50
3±n/a nM
Citation
 Whitlock, GAConlon, KMcMurray, GRoberts, LRStobie, AThurlow, RJ Novel 2-imidazoles as potent and selective alpha1A adrenoceptor partial agonists. Bioorg Med Chem Lett 18:2930-4 (2008)  
Target
Name:
Alpha-1A adrenergic receptor
Synonyms:
ADA1A_HUMAN ADRA1C Alpha 1A-adrenoceptor Alpha adrenergic receptor 1a Alpha-adrenergic receptor 1c adrenergic Alpha1 | adrenergic Alpha1C
Type:
Cell-surface receptors
Mol. Mass.:
51511.67
Organism:
Homo sapiens (Human)
Description:
P35348
Residue:
466
  
Inhibitor
Name:
BDBM50377387
Synonyms:
CHEMBL260720
Type:
Small organic molecule
Emp. Form.:
C16H16N4
Mol. Mass.:
264.325
SMILES:
Cc1[nH]ncc1-c1cccc2C(CCc12)c1ncc[nH]1
: