Target
Acetylcholinesterase
Ligand
BDBM50271556
Substrate
Meas. Tech.
ChEMBL_552463 (CHEMBL1002723)
Ki
0.015±n/a nM
Citation
 Butini, SCampiani, GBorriello, MGemma, SPanico, APersico, MCatalanotti, BRos, SBrindisi, MAgnusdei, MFiorini, INacci, VNovellino, EBelinskaya, TSaxena, AFattorusso, C Exploiting protein fluctuations at the active-site gorge of human cholinesterases: further optimization of the design strategy to develop extremely potent inhibitors. J Med Chem 51:3154-70 (2008)  
Target
Name:
Acetylcholinesterase
Synonyms:
3.1.1.7 Acetylcholinesterase (AChE) ache
Type:
Mol. Mass.:
65900.74
Organism:
Tetronarce californica (Pacific electric ray) (Torpedo californica)
Description:
P04058
Residue:
586
  
Inhibitor
Name:
BDBM50271556
Synonyms:
CHEMBL525622 | N,N,N-trimethyl-3-(2,2,2-trifluoroacetyl)benzenaminium
Type:
Small organic molecule
Emp. Form.:
C11H13F3NO
Mol. Mass.:
232.2217
SMILES:
C[N+](C)(C)c1cccc(c1)C(=O)C(F)(F)F
: