Target
Progesterone receptor
Ligand
BDBM50292762
Substrate
Meas. Tech.
ChEMBL_493922 (CHEMBL947334)
IC50
0.27±n/a nM
Citation
 Hödl, CRaunegger, KStrommer, REcker, GFKunert, OSturm, SSeger, CHaslinger, ESteiner, RStrauss, WSSchramm, HW Syntheses and antigestagenic activity of mifepristone derivatives. J Med Chem 52:1268-74 (2010)  
Target
Name:
Progesterone receptor
Synonyms:
NR3C3 PGR PRGR_HUMAN | progesterone
Type:
Protein
Mol. Mass.:
98979.52
Organism:
Homo sapiens (Human)
Description:
P06401
Residue:
933
  
Inhibitor
Name:
BDBM50292762
Synonyms:
17beta-Hydroxy-11beta-[4-(7-carboxy-N-methylheptylamino)-phenyl]-17alpha-(1-propinyl)-estra-4,9-dien-3-one | CHEMBL510869
Type:
Small organic molecule
Emp. Form.:
C36H47NO4
Mol. Mass.:
557.7627
SMILES:
CC#C[C@]1(O)CC[C@H]2[C@@H]3CCC4=CC(=O)CCC4=C3[C@H](C[C@]12C)c1ccc(cc1)N(C)CCCCCCCC(O)=O
: