Target
Carbonic anhydrase 12
Ligand
BDBM50155552
Substrate
Meas. Tech.
ChEMBL_544669 (CHEMBL1009246)
Ki
0.44±n/a nM
Citation
 Thiry, ARolin, SVullo, DFrankart, AScozzafava, ADogné, JMWouters, JSupuran, CTMasereel, B Indanesulfonamides as carbonic anhydrase inhibitors and anticonvulsant agents: structure-activity relationship and pharmacological evaluation. Eur J Med Chem 43:2853-60 (2008)  
Target
Name:
Carbonic anhydrase 12
Synonyms:
CA-XII CAH12_HUMAN Carbonic anhydrase Carbonic anhydrase XII Carbonic anhydrase XII (CAXII) | Tumor antigen HOM-RCC-3.1.3
Type:
Enzyme
Mol. Mass.:
39456.00
Organism:
Homo sapiens (Human)
Description:
Catalytic domain of human cloned isozyme was used in the assay
Residue:
354
  
Inhibitor
Name:
BDBM50155552
Synonyms:
4-Chloro-N-(5-sulfamoyl-indan-2-yl)-benzamide CHEMBL364127
Type:
Small organic molecule
Emp. Form.:
C16H15ClN2O3S
Mol. Mass.:
350.82
SMILES:
NS(=O)(=O)c1ccc2CC(Cc2c1)NC(=O)c1ccc(Cl)cc1
: