Target
Peroxisome proliferator-activated receptor delta
Ligand
BDBM50227736
Substrate
Meas. Tech.
ChEMBL_822293 (CHEMBL2038596)
IC50
3±n/a nM
Citation
 Méndez-Lucio, OPérez-Villanueva, JCastillo, RMedina-Franco, JL Activity landscape modeling of PPAR ligands with dual-activity difference maps. Bioorg Med Chem 20:3523-32 (2012)  
Target
Name:
Peroxisome proliferator-activated receptor delta
Synonyms:
NR1C2 NUCI Nuclear receptor subfamily 1 group C member 2 PPAR-beta PPARD Peroxisome proliferator-activated receptor Peroxisome proliferator-activated receptor delta
Type:
Enzyme
Mol. Mass.:
49910.45
Organism:
Homo sapiens (Human)
Description:
Q03181
Residue:
441
  
Inhibitor
Name:
BDBM50227736
Synonyms:
2-(4-(5-((2-fluoro-4-(trifluoromethyl)benzamido)methyl)-2-methylphenoxy)-2-methylphenoxy)-2-methylpropanoic acid | CHEMBL237307
Type:
Small organic molecule
Emp. Form.:
C27H25F4NO5
Mol. Mass.:
519.4847
SMILES:
Cc1ccc(CNC(=O)c2ccc(cc2F)C(F)(F)F)cc1Oc1ccc(OC(C)(C)C(O)=O)c(C)c1
: