Target
Aldo-keto reductase family 1 member C3
Ligand
BDBM50396735
Substrate
Meas. Tech.
ChEMBL_864305 (CHEMBL2175576)
Ki
111000±n/a nM
Citation
 Brožic, PTurk, SAdeniji, AOKonc, JJanežic, DPenning, TMLanišnik Rižner, TGobec, S Selective inhibitors of aldo-keto reductases AKR1C1 and AKR1C3 discovered by virtual screening of a fragment library. J Med Chem 55:7417-24 (2012)  
Target
Name:
Aldo-keto reductase family 1 member C3
Synonyms:
17-beta-Hydroxysteroid Dehydrogenase 5 (17-beta-HSD5, AKR1C3) AK1C3_HUMAN Aldo-keto reductase family 1 member C3 Aldo-keto reductase family 1 member C3 (AK1C3a) Aldo-keto-reductase family 1 member C3 Dihydrodiol dehydrogenase 3 Estradiol 17-beta-dehydrogenase KIAA0119 Prostaglandin F synthase Trans-1,2-dihydrobenzene-1,2-diol dehydrogenase
Type:
Enzyme
Mol. Mass.:
36859.86
Organism:
Homo sapiens (Human)
Description:
P42330
Residue:
323
  
Inhibitor
Name:
BDBM50396735
Synonyms:
CHEMBL2172250
Type:
Small organic molecule
Emp. Form.:
C14H13NO4S
Mol. Mass.:
291.322
SMILES:
Cc1ccc(cc1)S(=O)(=O)Nc1cccc(c1)C(O)=O
: