Target
Aldo-keto reductase family 1 member C2
Ligand
BDBM50396733
Substrate
Meas. Tech.
ChEMBL_864306 (CHEMBL2175577)
Ki
40000±n/a nM
Citation
 Brožic, PTurk, SAdeniji, AOKonc, JJanežic, DPenning, TMLanišnik Rižner, TGobec, S Selective inhibitors of aldo-keto reductases AKR1C1 and AKR1C3 discovered by virtual screening of a fragment library. J Med Chem 55:7417-24 (2012)  
Target
Name:
Aldo-keto reductase family 1 member C2
Synonyms:
3-alpha-HSD3 AK1C2_HUMAN Aldo-keto reductase family 1 member C2 (AK1C2) Aldo-keto reductase family 1 member C2 (AKR1C2) DD-2 DDH2 Dihydrodiol dehydrogenase/bile acid-binding protein Type III 3-alpha-hydroxysteroid dehydrogenase
Type:
Enzyme
Mol. Mass.:
36739.89
Organism:
Homo sapiens (Human)
Description:
Residue:
323
  
Inhibitor
Name:
BDBM50396733
Synonyms:
CHEMBL2172251
Type:
Small organic molecule
Emp. Form.:
C15H13N3O2
Mol. Mass.:
267.2826
SMILES:
Cc1ccn(Cc2cc(C(O)=O)c3ccccc3n2)n1
: