Target
Mu-type opioid receptor
Ligand
BDBM50354578
Substrate
Meas. Tech.
ChEMBL_875483 (CHEMBL2183124)
EC50
21±n/a nM
Citation
 Moynihan, HADerrick, IBroadbear, JHGreedy, BMAceto, MDHarris, LSPurington, LCThomas, MPWoods, JHTraynor, JRHusbands, SMLewis, JW Fumaroylamino-4,5-epoxymorphinans and related opioids with irreversibleµ opioid receptor antagonist effects. J Med Chem 55:9868-74 (2012)  
Target
Name:
Mu-type opioid receptor
Synonyms:
M-OR-1 Mu opioid receptor OPIATE Mu OPRM_CAVPO
Type:
Enzyme Catalytic Domain
Mol. Mass.:
11165.58
Organism:
GUINEA PIG
Description:
P97266
Residue:
98
  
Inhibitor
Name:
BDBM50354578
Synonyms:
BUPRENORPHINE US11534436, Compound buprenorphine | US9315514, Buprenorphine
Type:
Small organic molecule
Emp. Form.:
C29H41NO4
Mol. Mass.:
467.6401
SMILES:
CO[C@@]12CC[C@@]3(C[C@@H]1[C@](C)(O)C(C)(C)C)[C@H]1Cc4ccc(O)c5O[C@@H]2[C@]3(CCN1CC1CC1)c45
: