Target
5-hydroxytryptamine receptor 2C
Ligand
BDBM50403964
Substrate
Meas. Tech.
ChEBML_2739
IC50
3.8±n/a nM
Citation
 Andrés, JIAlcázar, JAlonso, JMDíaz, AFernández, JGil, PIturrino, LMatesanz, EMeert, TFMegens, ASipido, VK Synthesis and structure-activity relationship of 2-(aminoalkyl)-2,3,3a,8-tetrahydrodibenzo[c,f]isoxazolo[2,3-a]azepine derivatives: a novel series of 5-HT(2A/2C) receptor antagonists. Part 1. Bioorg Med Chem Lett 12:243-8 (2001)  
Target
Name:
5-hydroxytryptamine receptor 2C
Synonyms:
5-HT-2C 5-HT2C-INI 5-HTR2C 5-hydroxytryptamine receptor 2C (5-HT-2C) 5HT-1C HTR1C Serotonin (5-HT3) receptor Serotonin Receptor 2C
Type:
G Protein-Coupled Receptor (GPCR)
Mol. Mass.:
51836.79
Organism:
Homo sapiens (Human)
Description:
P28335
Residue:
458
  
Inhibitor
Name:
BDBM50403964
Synonyms:
CHEMBL310183 | R-95292
Type:
Small organic molecule
Emp. Form.:
C18H19ClN2O2
Mol. Mass.:
330.809
SMILES:
CN(C)CC1CC2N(O1)c1cc(Cl)ccc1Oc1ccccc21
: