Target
Histidine-rich protein PFHRP-II
Ligand
BDBM22985
Substrate
Meas. Tech.
ChEMBL_215890 (CHEMBL820822)
IC50
76.5±n/a nM
Citation
 Ryckebusch, ADeprez-Poulain, RMaes, LDebreu-Fontaine, MAMouray, EGrellier, PSergheraert, C Synthesis and in vitro and in vivo antimalarial activity of N1-(7-chloro-4-quinolyl)-1,4-bis(3-aminopropyl)piperazine derivatives. J Med Chem 46:542-57 (2003)  
Target
Name:
Histidine-rich protein PFHRP-II
Synonyms:
HRP1_PLAFA Histidine-rich protein PFHRP-II
Type:
PROTEIN
Mol. Mass.:
35156.49
Organism:
Plasmodium falciparum
Description:
ChEMBL_500704
Residue:
332
  
Inhibitor
Name:
BDBM22985
Synonyms:
Aralen CHLOROQUINE PHOSPHATE Chloroquine med.21724, Compound 8 | {4-[(7-chloroquinolin-4-yl)amino]pentyl}diethylamine
Type:
Antimalarial
Emp. Form.:
C18H26ClN3
Mol. Mass.:
319.872
SMILES:
CCN(CC)CCCC(C)Nc1ccnc2cc(Cl)ccc12
: