Target
Solute carrier family 22 member 2
Ligand
BDBM50420215
Substrate
Meas. Tech.
ChEMBL_836780 (CHEMBL2075305)
Ki
12±n/a nM
Citation
 Gründemann, DKöster, SKiefer, NBreidert, TEngelhardt, MSpitzenberger, FObermüller, NSchömig, E Transport of monoamine transmitters by the organic cation transporter type 2, OCT2. J Biol Chem 273:30915-20 (1998)  
Target
Name:
Solute carrier family 22 member 2
Synonyms:
Adrenaline alpha2 Organic cation transporter 2 Slc22a2 rOCT2
Type:
Enzyme Catalytic Domain
Mol. Mass.:
62348.38
Organism:
RAT
Description:
Adrenaline alpha2 0 RAT::Q9R0W2
Residue:
555
  
Inhibitor
Name:
BDBM50420215
Synonyms:
CHEMBL339858
Type:
Small organic molecule
Emp. Form.:
C25H27N2
Mol. Mass.:
355.4947
SMILES:
CC(C)N1\C(=C/c2cc[n+](C(C)C)c3ccccc23)C=Cc2ccccc12
: