Target
Beta-lactamase
Ligand
BDBM50421221
Substrate
Meas. Tech.
ChEMBL_839906 (CHEMBL2090107)
IC50
>200000±n/a nM
Citation
 Chen, PHorton, LBMikulski, RLDeng, LSundriyal, SPalzkill, TSong, Y 2-Substituted 4,5-dihydrothiazole-4-carboxylic acids are novel inhibitors of metallo-ß-lactamases. Bioorg Med Chem Lett 22:6229-32 (2012)  
Target
Name:
Beta-lactamase
Synonyms:
BAS3245 Beta-lactamase II bla2
Type:
Enzyme
Mol. Mass.:
28177.23
Organism:
Bacillus anthracis
Description:
Q93T40
Residue:
256
  
Inhibitor
Name:
BDBM50421221
Synonyms:
CHEMBL1722922
Type:
Small organic molecule
Emp. Form.:
C11H9NO2S
Mol. Mass.:
219.26
SMILES:
OC(=O)c1csc(Cc2ccccc2)n1
: