Target
Multidrug and toxin extrusion protein 2
Ligand
BDBM50295557
Substrate
Meas. Tech.
ChEMBL_934318 (CHEMBL2320304)
IC50
12600±n/a nM
Citation
 Wittwer, MBZur, AAKhuri, NKido, YKosaka, AZhang, XMorrissey, KMSali, AHuang, YGiacomini, KM Discovery of potent, selective multidrug and toxin extrusion transporter 1 (MATE1, SLC47A1) inhibitors through prescription drug profiling and computational modeling. J Med Chem 56:781-95 (2013)  
Target
Name:
Multidrug and toxin extrusion protein 2
Synonyms:
Kidney-specific H(+)/organic cation antiporter MATE2 SLC47A2 hMATE-2
Type:
PROTEIN
Mol. Mass.:
65098.38
Organism:
Homo sapiens (Human)
Description:
ChEMBL_934314
Residue:
602
  
Inhibitor
Name:
BDBM50295557
Synonyms:
7-Methyl-4,6,6a,7,8,9,10,10a-octahydro-indolo[4,3-fg]quinoline-9-carboxylic acid ((2R,5S,10bS)-5-benzyl-10b-hydroxy-2-methyl-3,6-dioxo-octahydro-oxazolo[3,2-a]pyrrolo[2,1-c]pyrazin-2-yl)-amide CHEMBL1732 Dihydroer-gotamin
Type:
Small organic molecule
Emp. Form.:
C33H37N5O5
Mol. Mass.:
583.6774
SMILES:
CN1C[C@@H](C[C@H]2[C@H]1Cc1c[nH]c3cccc2c13)C(=O)N[C@]1(C)O[C@@]2(O)[C@@H]3CCCN3C(=O)[C@H](Cc3ccccc3)N2C1=O
: