Target
Multidrug and toxin extrusion protein 1
Ligand
BDBM13530
Substrate
Meas. Tech.
ChEMBL_934320 (CHEMBL2320306)
IC50
350±n/a nM
Citation
 Wittwer, MBZur, AAKhuri, NKido, YKosaka, AZhang, XMorrissey, KMSali, AHuang, YGiacomini, KM Discovery of potent, selective multidrug and toxin extrusion transporter 1 (MATE1, SLC47A1) inhibitors through prescription drug profiling and computational modeling. J Med Chem 56:781-95 (2013)  
Target
Name:
Multidrug and toxin extrusion protein 1
Synonyms:
MATE-1 S47A1_HUMAN Solute carrier family 47 member 1 | hMATE-1
Type:
PROTEIN
Mol. Mass.:
61928.01
Organism:
Homo sapiens (Human)
Description:
ChEMBL_934313
Residue:
570
  
Inhibitor
Name:
BDBM13530
Synonyms:
4-[(4-methylpiperazin-1-yl)methyl]-N-[4-methyl-3-[(4-pyridin-3-ylpyrimidin-2-yl)amino]phenyl]benzamide Gleevec Imatinib, 21 STI-571 US10906896, Cpd imatinib US11725005, Compound imatinib cid_5291 med.21724, Compound 6
Type:
Small organic molecule
Emp. Form.:
C29H31N7O
Mol. Mass.:
493.6027
SMILES:
CN1CCN(Cc2ccc(cc2)C(=O)Nc2ccc(C)c(Nc3nccc(n3)-c3cccnc3)c2)CC1
: