Target
Multidrug and toxin extrusion protein 1
Ligand
BDBM50170723
Substrate
Meas. Tech.
ChEMBL_934320 (CHEMBL2320306)
IC50
700±n/a nM
Citation
 Wittwer, MBZur, AAKhuri, NKido, YKosaka, AZhang, XMorrissey, KMSali, AHuang, YGiacomini, KM Discovery of potent, selective multidrug and toxin extrusion transporter 1 (MATE1, SLC47A1) inhibitors through prescription drug profiling and computational modeling. J Med Chem 56:781-95 (2013)  
Target
Name:
Multidrug and toxin extrusion protein 1
Synonyms:
MATE-1 S47A1_HUMAN Solute carrier family 47 member 1 | hMATE-1
Type:
PROTEIN
Mol. Mass.:
61928.01
Organism:
Homo sapiens (Human)
Description:
ChEMBL_934313
Residue:
570
  
Inhibitor
Name:
BDBM50170723
Synonyms:
1,1'-Hexamethylene bis(5-(p-chlorophenyl)biguanide) CHLORHEXIDINE N,N'-Bis(4-chlorophenyl)-3,12-diimino-2,4,11,13-tetraazatetradecanediimidamide
Type:
Small organic molecule
Emp. Form.:
C22H30Cl2N10
Mol. Mass.:
505.447
SMILES:
NC(NC(N)=Nc1ccc(Cl)cc1)=NCCCCCCN=C(N)N=C(N)Nc1ccc(Cl)cc1
: