Target
A disintegrin and metalloproteinase with thrombospondin motifs 5
Ligand
BDBM50175535
Substrate
Meas. Tech.
ChEMBL_948655 (CHEMBL2345605)
IC50
3400±n/a nM
Citation
 Nuti, ESantamaria, SCasalini, FYamamoto, KMarinelli, LLa Pietra, VNovellino, EOrlandini, ENencetti, SMarini, AMSalerno, STaliani, SDa Settimo, FNagase, HRossello, A Arylsulfonamide inhibitors of aggrecanases as potential therapeutic agents for osteoarthritis: synthesis and biological evaluation. Eur J Med Chem 62:379-94 (2013)  
Target
Name:
A disintegrin and metalloproteinase with thrombospondin motifs 5
Synonyms:
A disintegrin and metalloproteinase with thrombospondin motifs 5 (ADAMTS-5) ADAMTS5 ATS5_HUMAN Metalloproteinase with thrombospondin motifs 5 (ADAMTS-5)
Type:
Enzyme
Mol. Mass.:
101769.09
Organism:
Homo sapiens (Human)
Description:
Q9UNA0
Residue:
930
  
Inhibitor
Name:
BDBM50175535
Synonyms:
2-(4-Butoxy-benzenesulfonylamino)-N-hydroxy-acetamide | CHEMBL197842
Type:
Small organic molecule
Emp. Form.:
C12H18N2O5S
Mol. Mass.:
302.347
SMILES:
CCCCOc1ccc(cc1)S(=O)(=O)NCC(=O)NO
: