Target
Serine/threonine-protein kinase Nek1
Ligand
BDBM50431028
Substrate
Meas. Tech.
ChEMBL_947331 (CHEMBL2344115)
IC50
3500±n/a nM
Citation
 Brown, AShi, QMoore, TWYoon, YPrussia, AMaddox, CLiotta, DCShim, HSnyder, JP Monocarbonyl curcumin analogues: heterocyclic pleiotropic kinase inhibitors that mediate anticancer properties. J Med Chem 56:3456-66 (2013)  
Target
Name:
Serine/threonine-protein kinase Nek1
Synonyms:
KIAA1901 NEK1 Never in mitosis A-related kinase 1 Renal carcinoma antigen NY-REN-55
Type:
Protein
Mol. Mass.:
142810.07
Organism:
Homo sapiens (Human)
Description:
Residue:
1258
  
Inhibitor
Name:
BDBM50431028
Synonyms:
CHEMBL2338333
Type:
Small organic molecule
Emp. Form.:
C18H17N3O
Mol. Mass.:
291.3471
SMILES:
CN1C\C(=C/c2ccccn2)C(=O)\C(C1)=C\c1ccccn1
: