Target
Receptor-type tyrosine-protein kinase FLT3
Ligand
BDBM50434616
Substrate
Meas. Tech.
ChEMBL_963010 (CHEMBL2390018)
IC50
13±n/a nM
Citation
 Lin, WHHsu, JTHsieh, SYChen, CTSong, JSYen, SCHsu, TLu, CTChen, CHChou, LHYang, YNChiu, CHChen, CPTseng, YJYen, KJYeh, CFChao, YSYeh, TKJiaang, WT Discovery of 3-phenyl-1H-5-pyrazolylamine derivatives containing a urea pharmacophore as potent and efficacious inhibitors of FMS-like tyrosine kinase-3 (FLT3). Bioorg Med Chem 21:2856-67 (2013)  
Target
Name:
Receptor-type tyrosine-protein kinase FLT3
Synonyms:
CD135 FL cytokine receptor FLK2 FLT3 Fetal liver kinase-2 Fms-like tyrosine kinase 3 (Flt-3) STK-1 Stem cell tyrosine kinase 1
Type:
Enzyme
Mol. Mass.:
112888.62
Organism:
Homo sapiens (Human)
Description:
P36888
Residue:
993
  
Inhibitor
Name:
BDBM50434616
Synonyms:
CHEMBL2386801
Type:
Small organic molecule
Emp. Form.:
C27H30N8O3
Mol. Mass.:
514.5789
SMILES:
CN1CCN(CC1)c1ccc(cc1)C(=O)Nc1cc(n[nH]1)-c1ccc(CNC(=O)Nc2cc(C)on2)cc1
: