Target
G-protein coupled receptor 35
Ligand
BDBM50436005
Substrate
Meas. Tech.
ChEMBL_982934 (CHEMBL2429574)
Ki
331±n/a nM
Citation
 Thimm, DFunke, MMeyer, AMüller, CE 6-Bromo-8-(4-[(3)H]methoxybenzamido)-4-oxo-4H-chromene-2-carboxylic Acid: a powerful tool for studying orphan G protein-coupled receptor GPR35. J Med Chem 56:7084-99 (2013)  
Target
Name:
G-protein coupled receptor 35
Synonyms:
G protein-coupled receptor 35 GPR35_HUMAN
Type:
Enzyme Catalytic Domain
Mol. Mass.:
34085.57
Organism:
Homo sapiens (Human)
Description:
gi_33695097
Residue:
309
  
Inhibitor
Name:
BDBM50436005
Synonyms:
CHEMBL2392176
Type:
Small organic molecule
Emp. Form.:
C18H12BrNO6
Mol. Mass.:
418.195
SMILES:
COc1ccccc1C(=O)Nc1cc(Br)cc2c1oc(cc2=O)C(O)=O
: