Target
G-protein coupled receptor 35
Ligand
BDBM38549
Substrate
Meas. Tech.
ChEMBL_982934 (CHEMBL2429574)
Ki
12±n/a nM
Citation
 Thimm, DFunke, MMeyer, AMüller, CE 6-Bromo-8-(4-[(3)H]methoxybenzamido)-4-oxo-4H-chromene-2-carboxylic Acid: a powerful tool for studying orphan G protein-coupled receptor GPR35. J Med Chem 56:7084-99 (2013)  
Target
Name:
G-protein coupled receptor 35
Synonyms:
G protein-coupled receptor 35 GPR35_HUMAN
Type:
Enzyme Catalytic Domain
Mol. Mass.:
34085.57
Organism:
Homo sapiens (Human)
Description:
gi_33695097
Residue:
309
  
Inhibitor
Name:
BDBM38549
Synonyms:
2-[2-[4-[(4-chlorophenyl)-phenyl-methyl]piperazino]ethoxy]ethanol 4-[(3-carboxy-2-hydroxy-1-naphthalenyl)methyl]-3-hydroxy-2-naphthalenecarboxylic acid CHEMBL170358 HYDROXYZINE PAMOATE Pamoic acid US11744839, Compound of formula 8 | cid_25096
Type:
Small organic molecule
Emp. Form.:
C23H16O6
Mol. Mass.:
388.3695
SMILES:
OC(=O)c1cc2ccccc2c(Cc2c(O)c(cc3ccccc23)C(O)=O)c1O
: