Target
Multidrug and toxin extrusion protein 1
Ligand
BDBM18512
Substrate
Meas. Tech.
ChEMBL_1279072 (CHEMBL3094621)
Ki
145±n/a nM
Citation
 Hume, WEShingaki, TTakashima, THashizume, YOkauchi, TKatayama, YHayashinaka, EWada, YKusuhara, HSugiyama, YWatanabe, Y The synthesis and biodistribution of [(11)C]metformin as a PET probe to study hepatobiliary transport mediated by the multi-drug and toxin extrusion transporter 1 (MATE1) in vivo. Bioorg Med Chem 21:7584-90 (2013)  
Target
Name:
Multidrug and toxin extrusion protein 1
Synonyms:
MATE-1 S47A1_MOUSE Solute carrier family 47 member 1 | mMATE-1
Type:
PROTEIN
Mol. Mass.:
61647.84
Organism:
Mus musculus
Description:
ChEMBL_107975
Residue:
567
  
Inhibitor
Name:
BDBM18512
Synonyms:
5-(4-chlorophenyl)-6-ethylpyrimidine-2,4-diamine Pyrimethamine (Pyr) cid_4993
Type:
Small organic molecule
Emp. Form.:
C12H13ClN4
Mol. Mass.:
248.711
SMILES:
CCc1nc(N)nc(N)c1-c1ccc(Cl)cc1
: